Quantcast
Channel: Ionic Framework - Ionic Forum
Viewing all articles
Browse latest Browse all 49169

Error when build android apk

$
0
0

@sheir wrote:

i got this error when build android apk

FAILURE: Build failed with an exception.

  • What went wrong:
    Execution failed for task ':transformClassesWithMultidexlistForRelease'.

    com.android.build.api.transform.TransformException: com.android.ide.common.process.ProcessException: org.gradle.process.internal.ExecException: Process 'command 'C:\Program Files\Java\jdk1.7.0_79\bin\java.exe'' finished with non-zero exit value 1

  • Try:
    Run with --stacktrace option to get the stack trace. Run with --info or --debug option to get more log output.

Posts: 1

Participants: 1

Read full topic


Viewing all articles
Browse latest Browse all 49169

Trending Articles



<script src="https://jsc.adskeeper.com/r/s/rssing.com.1596347.js" async> </script>